Reaction Details
TargetDelta-type opioid receptor
LigandBDBM50177683
Substrate/Competitorn/a
Meas. Tech.ChEMBL_333515 (CHEMBL866454)
Ki 580±n/a nM
Citation Le Bourdonnec, BGoodman, AJMichaut, MYe, HFGraczyk, TMBelanger, SDeHaven, RNDolle, RE Synthesis and structure-activity relationships of a new series of 2alpha-substituted trans-4,5-dimethyl-4-(3-hydroxyphenyl)piperidine as mu-selective opioid antagonists. Bioorg Med Chem Lett16:864-8 (2006) 
 
Delta-type opioid receptor
Name:Delta-type opioid receptor
Type:G Protein-Coupled Receptor (GPCR)
Mol. Mass.:40382.98
Organism:Homo sapiens (Human)
Description:Competition binding assays were carried out using membrane preparations from transfected HN9.10 cells that constitutively expressed the delta opioid receptor.
Residue:372
BDBM50177683
NameBDBM50177683
Synonyms:3-(2-alpha-butyl-trans-4,5-dimethyl-1-phenethylpiperidin-4-yl)phenol | CHEMBL202352
TypeSmall organic molecule
Emp. Form.C25H35NO
Mol. Mass.365.5515
SMILESCCCC[C@@H]1C[C@](C)([C@@H](C)CN1CCc1ccccc1)c1cccc(O)c1