Reaction Details
TargetMu-type opioid receptor
LigandBDBM50177682
Substrate/Competitorn/a
Meas. Tech.ChEMBL_333516 (CHEMBL866455)
IC50 360±n/a nM
Citation Le Bourdonnec, BGoodman, AJMichaut, MYe, HFGraczyk, TMBelanger, SDeHaven, RNDolle, RE Synthesis and structure-activity relationships of a new series of 2alpha-substituted trans-4,5-dimethyl-4-(3-hydroxyphenyl)piperidine as mu-selective opioid antagonists. Bioorg Med Chem Lett16:864-8 (2006) 
 
Mu-type opioid receptor
Name:Mu-type opioid receptor
Type:G Protein-Coupled Receptor (GPCR)
Mol. Mass.:44789.51
Organism:Homo sapiens (Human)
Description:P35372
Residue:400
BDBM50177682
NameBDBM50177682
Synonyms:3-(trans-4,5-dimethyl-1-phenethyl-2-alpha-(3-phenylpropyl)piperidin-4-yl)phenol | CHEMBL383044
TypeSmall organic molecule
Emp. Form.C30H37NO
Mol. Mass.427.6209
SMILESC[C@H]1CN(CCc2ccccc2)[C@H](CCCc2ccccc2)C[C@@]1(C)c1cccc(O)c1