Reaction Details
TargetMu-type opioid receptor
LigandBDBM50177693
Substrate/Competitorn/a
Meas. Tech.ChEMBL_333516 (CHEMBL866455)
IC50 320±n/a nM
Citation Le Bourdonnec, BGoodman, AJMichaut, MYe, HFGraczyk, TMBelanger, SDeHaven, RNDolle, RE Synthesis and structure-activity relationships of a new series of 2alpha-substituted trans-4,5-dimethyl-4-(3-hydroxyphenyl)piperidine as mu-selective opioid antagonists. Bioorg Med Chem Lett16:864-8 (2006) 
 
Mu-type opioid receptor
Name:Mu-type opioid receptor
Type:G Protein-Coupled Receptor (GPCR)
Mol. Mass.:44789.51
Organism:Homo sapiens (Human)
Description:P35372
Residue:400
BDBM50177693
NameBDBM50177693
Synonyms:3-(trans-4,5-dimethyl-1,2(alpha)-dipropylpiperidin-4-yl)phenol | CHEMBL202139
TypeSmall organic molecule
Emp. Form.C19H31NO
Mol. Mass.289.4555
SMILESCCC[C@@H]1C[C@](C)([C@@H](C)CN1CCC)c1cccc(O)c1