Reaction Details
TargetSodium-dependent dopamine transporter
LigandBDBM50101075
Substrate/Competitorn/a
Meas. Tech.ChEMBL_326508 (CHEMBL864475)
Ki 0.2±n/a nM
Citation Cha, JHZou, MFAdkins, EMRasmussen, SGLoland, CJSchoenenberger, BGether, UNewman, AH Rhodamine-labeled 2beta-carbomethoxy-3beta-(3,4-dichlorophenyl)tropane analogues as high-affinity fluorescent probes for the dopamine transporter. J Med Chem48:7513-6 (2005) 
 
Sodium-dependent dopamine transporter
Name:Sodium-dependent dopamine transporter
Type:Multi-pass membrane protein
Mol. Mass.:68497.11
Organism:Homo sapiens (Human)
Description:Q01959
Residue:620
BDBM50101075
NameBDBM50101075
Synonyms:(2S,3S)-3-(3,4-Dichloro-phenyl)-2-methoxycarbonyl-8-methyl-8-azonia-bicyclo[3.2.1]octane (2S,3S)-methyl 3-(3,4-dichlorophenyl)-8-methyl-8-aza-bicyclo[3.2.1]octane-2-carboxylate CHEMBL42553 | RTI-111
TypeSmall organic molecule
Emp. Form.C16H19Cl2NO2
Mol. Mass.328.234
SMILESCOC(=O)[C@@H]1C2CCC(C[C@@H]1c1ccc(Cl)c(Cl)c1)N2C