Reaction Details
TargetSodium-dependent dopamine transporter
LigandBDBM50177767
Substrate/Competitorn/a
Meas. Tech.ChEMBL_326508 (CHEMBL864475)
Ki 18±n/a nM
Citation Cha, JHZou, MFAdkins, EMRasmussen, SGLoland, CJSchoenenberger, BGether, UNewman, AH Rhodamine-labeled 2beta-carbomethoxy-3beta-(3,4-dichlorophenyl)tropane analogues as high-affinity fluorescent probes for the dopamine transporter. J Med Chem48:7513-6 (2005) 
 
Sodium-dependent dopamine transporter
Name:Sodium-dependent dopamine transporter
Type:Multi-pass membrane protein
Mol. Mass.:68497.11
Organism:Homo sapiens (Human)
Description:Q01959
Residue:620
BDBM50177767
NameBDBM50177767
Synonyms:2-(3-sec-Butylimino-6-diethylamino-3H-xanthen-9-yl)-5-(5-{2-[3-(3,4-dichloro-phenyl)-2-methoxycarbonyl-8-aza-bicyclo[3.2.1]oct-8-yl]-ethylcarbamoyl}-pentylsulfamoyl)-benzenesulfonic acid anion | CHEMBL196760
TypeSmall organic molecule
Emp. Form.C50H61Cl2N5O9S2
Mol. Mass.1011.083
SMILESCCN(CC)c1ccc2c(-c3ccc(cc3S([O-])(=O)=O)S(=O)(=O)NCCCCCC(=O)NCCN3C4CCC3[C@H]([C@H](C4)c3ccc(Cl)c(Cl)c3)C(=O)OC)c3ccc(cc3oc2c1)=[N+](CC)CC