Reaction Details
TargetPotassium voltage-gated channel subfamily H member 2
LigandBDBM50067935
Substrate/Competitorn/a
Meas. Tech.ChEMBL_332690 (CHEMBL858932)
Ki 1800±n/a nM
Citation Thomson, CGCarlson, EChicchi, GGKulagowski, JJKurtz, MMSwain, CJTsao, KLWheeldon, A Synthesis and structure-activity relationships of 8-azabicyclo[3.2.1]octane benzylamine NK1 antagonists. Bioorg Med Chem Lett16:811-4 (2006) 
 
Potassium voltage-gated channel subfamily H member 2
Name:Potassium voltage-gated channel subfamily H member 2
Type:Multi-pass membrane protein
Mol. Mass.:126672.65
Organism:Homo sapiens (Human)
Description:Q12809
Residue:1159
BDBM50067935
NameBDBM50067935
Synonyms:(2-Methoxy-5-trifluoromethoxy-benzyl)-((2S,3S)-2-phenyl-piperidin-3-yl)-amine CHEMBL319118 | CP-122721
TypeSmall organic molecule
Emp. Form.C20H23F3N2O2
Mol. Mass.380.404
SMILESCOc1ccc(OC(F)(F)F)cc1CN[C@H]1CCCN[C@H]1c1ccccc1