Reaction Details
TargetAdenosine receptor A3
LigandBDBM50179029
Substrate/Competitorn/a
Meas. Tech.ChEMBL_338529 (CHEMBL867190)
Ki 155±n/a nM
Citation González, MPTerán, CTeijeira, M A topological function based on spectral moments for predicting affinity toward A3 adenosine receptors. Bioorg Med Chem Lett16:1291-6 (2006) 
 
Adenosine receptor A3
Name:Adenosine receptor A3
Type:PROTEIN
Mol. Mass.:36643.73
Organism:Rattus norvegicus
Description:ChEMBL_479910
Residue:320
BDBM50179029
NameBDBM50179029
Synonyms:(2S,3S,4R,5R)-3,4-Dihydroxy-5-(6-{3-[4-(5-methyl-isoxazol-3-ylsulfamoyl)-phenyl]-ureido}-purin-9-yl)-tetrahydro-furan-2-carboxylic acid ethylamide | CHEMBL203859
TypeSmall organic molecule
Emp. Form.C23H25N9O8S
Mol. Mass.587.565
SMILESCCNC(=O)[C@H]1O[C@H]([C@H](O)[C@@H]1O)n1cnc2c(NC(=O)Nc3ccc(cc3)S(=O)(=O)Nc3cc(C)on3)ncnc12