Reaction Details
Target5-hydroxytryptamine receptor 2C
LigandBDBM50179081
Substrate/Competitorn/a
Meas. Tech.ChEMBL_340094 (CHEMBL861244)
Ki 52±n/a nM
Citation Richter, HGAdams, DRBenardeau, ABickerdike, MJBentley, JMBlench, TJCliffe, IADourish, CHebeisen, PKennett, GAKnight, ARMalcolm, CSMattei, PMisra, AMizrahi, JMonck, NJPlancher, JMRoever, SRoffey, JRTaylor, SVickers, SP Synthesis and biological evaluation of novel hexahydro-pyrido[3',2':4,5]pyrrolo[1,2-a]pyrazines as potent and selective 5-HT(2C) receptor agonists. Bioorg Med Chem Lett16:1207-11 (2006) 
 
5-hydroxytryptamine receptor 2C
Name:5-hydroxytryptamine receptor 2C
Type:G Protein-Coupled Receptor (GPCR)
Mol. Mass.:51836.79
Organism:Homo sapiens (Human)
Description:P28335
Residue:458
BDBM50179081
NameBDBM50179081
Synonyms:(4R,9aS)-6-chloro-4-methyl-1,2,3,4,9,9a-hexahydro-2,4a,5-triaza-fluorene | CHEMBL203396
TypeSmall organic molecule
Emp. Form.C11H14ClN3
Mol. Mass.223.702
SMILESC[C@@H]1CNC[C@@H]2Cc3ccc(Cl)nc3N12