Reaction Details
Target5-hydroxytryptamine receptor 2A
LigandBDBM50179078
Substrate/Competitorn/a
Meas. Tech.ChEMBL_340092 (CHEMBL861242)
Ki 565±n/a nM
Citation Richter, HGAdams, DRBenardeau, ABickerdike, MJBentley, JMBlench, TJCliffe, IADourish, CHebeisen, PKennett, GAKnight, ARMalcolm, CSMattei, PMisra, AMizrahi, JMonck, NJPlancher, JMRoever, SRoffey, JRTaylor, SVickers, SP Synthesis and biological evaluation of novel hexahydro-pyrido[3',2':4,5]pyrrolo[1,2-a]pyrazines as potent and selective 5-HT(2C) receptor agonists. Bioorg Med Chem Lett16:1207-11 (2006) 
 
5-hydroxytryptamine receptor 2A
Name:5-hydroxytryptamine receptor 2A
Type:undefined
Mol. Mass.:52607.65
Organism:Homo sapiens (Human)
Description:P28223
Residue:471
BDBM50179078
NameBDBM50179078
Synonyms:(4R,9aR)-6-methoxymethyl-4-methyl-1,2,3,4,9,9a-hexahydro-2,4a,5-triaza-fluorene | CHEMBL383051
TypeSmall organic molecule
Emp. Form.C13H19N3O
Mol. Mass.233.3095
SMILESCOCc1ccc2C[C@@H]3CNC[C@@H](C)N3c2n1