Reaction Details
Target5-hydroxytryptamine receptor 2C
LigandBDBM50169261
Substrate/Competitorn/a
Meas. Tech.ChEMBL_340094 (CHEMBL861244)
Ki 1.9±n/a nM
Citation Richter, HGAdams, DRBenardeau, ABickerdike, MJBentley, JMBlench, TJCliffe, IADourish, CHebeisen, PKennett, GAKnight, ARMalcolm, CSMattei, PMisra, AMizrahi, JMonck, NJPlancher, JMRoever, SRoffey, JRTaylor, SVickers, SP Synthesis and biological evaluation of novel hexahydro-pyrido[3',2':4,5]pyrrolo[1,2-a]pyrazines as potent and selective 5-HT(2C) receptor agonists. Bioorg Med Chem Lett16:1207-11 (2006) 
 
5-hydroxytryptamine receptor 2C
Name:5-hydroxytryptamine receptor 2C
Type:G Protein-Coupled Receptor (GPCR)
Mol. Mass.:51836.79
Organism:Homo sapiens (Human)
Description:P28335
Residue:458
BDBM50169261
NameBDBM50169261
Synonyms:(4R,10aS)-7-Chloro-4,6-dimethyl-1,2,3,4,10,10a-hexahydro-pyrazino[1,2-a]indole CHEMBL191054
TypeSmall organic molecule
Emp. Form.C13H17ClN2
Mol. Mass.236.74
SMILESC[C@@H]1CNC[C@@H]2Cc3ccc(Cl)c(C)c3N12