Reaction Details
Target5-hydroxytryptamine receptor 2A
LigandBDBM50179079
Substrate/Competitorn/a
Meas. Tech.ChEMBL_340092 (CHEMBL861242)
Ki 43±n/a nM
Citation Richter, HGAdams, DRBenardeau, ABickerdike, MJBentley, JMBlench, TJCliffe, IADourish, CHebeisen, PKennett, GAKnight, ARMalcolm, CSMattei, PMisra, AMizrahi, JMonck, NJPlancher, JMRoever, SRoffey, JRTaylor, SVickers, SP Synthesis and biological evaluation of novel hexahydro-pyrido[3',2':4,5]pyrrolo[1,2-a]pyrazines as potent and selective 5-HT(2C) receptor agonists. Bioorg Med Chem Lett16:1207-11 (2006) 
 
5-hydroxytryptamine receptor 2A
Name:5-hydroxytryptamine receptor 2A
Type:undefined
Mol. Mass.:52607.65
Organism:Homo sapiens (Human)
Description:P28223
Residue:471
BDBM50179079
NameBDBM50179079
Synonyms:(4R,9aR)-4-methyl-6-trifluoromethyl-1,2,3,4,9,9a-hexahydro-2,4a,5-triaza-fluorene | CHEMBL206333
TypeSmall organic molecule
Emp. Form.C12H14F3N3
Mol. Mass.257.2549
SMILESC[C@@H]1CNC[C@H]2Cc3ccc(nc3N12)C(F)(F)F