Reaction Details
TargetBeta-1 adrenergic receptor
LigandBDBM50179073
Substrate/Competitorn/a
Meas. Tech.ChEMBL_340108 (CHEMBL863738)
Ki>1000±n/a nM
Citation Richter, HGAdams, DRBenardeau, ABickerdike, MJBentley, JMBlench, TJCliffe, IADourish, CHebeisen, PKennett, GAKnight, ARMalcolm, CSMattei, PMisra, AMizrahi, JMonck, NJPlancher, JMRoever, SRoffey, JRTaylor, SVickers, SP Synthesis and biological evaluation of novel hexahydro-pyrido[3',2':4,5]pyrrolo[1,2-a]pyrazines as potent and selective 5-HT(2C) receptor agonists. Bioorg Med Chem Lett16:1207-11 (2006) 
 
Beta-1 adrenergic receptor
Name:Beta-1 adrenergic receptor
Type:G Protein-Coupled Receptor (GPCR)
Mol. Mass.:51338.40
Organism:Homo sapiens (Human)
Description:P08588
Residue:477
BDBM50179073
NameBDBM50179073
Synonyms:(4R,9aR)-6-Cyclopropylmethoxymethyl-4-methyl-1,2,3,4,9,9a-hexahydro-2,4a,5-triaza-fluorene | CHEMBL203013
TypeSmall organic molecule
Emp. Form.C16H23N3O
Mol. Mass.273.3733
SMILESC[C@@H]1CNC[C@H]2Cc3ccc(COCC4CC4)nc3N12