Reaction Details
TargetPutative sugar transporter
LigandBDBM50179092
Substrate/Competitorn/a
Meas. Tech.ChEMBL_338364 (CHEMBL866544)
Ki 140000±n/a nM
Citation Fayolle, MIonita, MKrishna, SMorin, CPatel, AP Probing structure/affinity relationships for the Plasmodium falciparum hexose transporter with glucose derivatives. Bioorg Med Chem Lett16:1267-71 (2006) 
 
Putative sugar transporter
Name:Putative sugar transporter
Synonyms:Hexose transporter 1
Type:PROTEIN
Mol. Mass.:56427.07
Organism:Plasmodium falciparum
Description:ChEMBL_456666
Residue:504
BDBM50179092
NameBDBM50179092
TypeSmall organic molecule
Emp. Form.C32H60O10
Mol. Mass.604.8128
SMILESOC[C@H]1OC(O)[C@H](O)[C@@H](CCCCCCCCC\C=C/CCCCCCCCC[C@H]2[C@H](O)C(O)O[C@@H](CO)[C@@H]2O)[C@@H]1O