Reaction Details
TargetPutative sugar transporter
LigandBDBM50179097
Substrate/Competitorn/a
Meas. Tech.ChEMBL_338364 (CHEMBL866544)
Ki 19000±n/a nM
Citation Fayolle, MIonita, MKrishna, SMorin, CPatel, AP Probing structure/affinity relationships for the Plasmodium falciparum hexose transporter with glucose derivatives. Bioorg Med Chem Lett16:1267-71 (2006) 
 
Putative sugar transporter
Name:Putative sugar transporter
Synonyms:Hexose transporter 1
Type:PROTEIN
Mol. Mass.:56427.07
Organism:Plasmodium falciparum
Description:ChEMBL_456666
Residue:504
BDBM50179097
NameBDBM50179097
TypeSmall organic molecule
Emp. Form.C16H32O6
Mol. Mass.320.4217
SMILESCCCCCCCCCCO[C@@H]1[C@@H](O)C(O)O[C@H](CO)[C@H]1O