Reaction Details
TargetAdenosine receptor A1
LigandBDBM50085658
Substrate/Competitorn/a
Meas. Tech.ChEMBL_325326 (CHEMBL860161)
Ki 0.83±n/a nM
Citation Jacobson, KAGao, ZGTchilibon, SDuong, HTJoshi, BVSonin, DLiang, BT Semi-rational design of (north)-methanocarba nucleosides as dual acting A(1) and A(3) adenosine receptor agonists: novel prototypes for cardioprotection. J Med Chem48:8103-7 (2005) 
 
Adenosine receptor A1
Name:Adenosine receptor A1
Type:G Protein-Coupled Receptor (GPCR)
Mol. Mass.:36520.92
Organism:Homo sapiens (Human)
Description:P30542
Residue:326
BDBM50085658
NameBDBM50085658
Synonyms:(2R,3R,4S,5R)-2-(2-Chloro-6-cyclopentylamino-purin-9-yl)-5-hydroxymethyl-tetrahydro-furan-3,4-diol 2-(2-Chloro-6-cyclopentylamino-purin-9-yl)-5-hydroxymethyl-tetrahydro-furan-3,4-diol 2-Cl-CPA 5-(2-Chloro-6-cyclopentylamino-purin-9-yl)-tetrahydro-furan-2,3,4-triol CHEMBL284969 | N6-Cyclopentyl-2-chloroAdo
TypeSmall organic molecule
Emp. Form.C15H20ClN5O4
Mol. Mass.369.803
SMILESOC[C@H]1O[C@H]([C@H](O)[C@@H]1O)n1cnc2c(NC3CCCC3)nc(Cl)nc12