Reaction Details
TargetFibroblast growth factor 2
LigandBDBM50179254
Substrate/Competitorn/a
Meas. Tech.ChEMBL_325519 (CHEMBL859218)
Kd 86±n/a nM
Citation Karoli, TLiu, LFairweather, JKHammond, ELi, CPCochran, SBergefall, KTrybala, EAddison, RSFerro, V Synthesis, biological activity, and preliminary pharmacokinetic evaluation of analogues of a phosphosulfomannan angiogenesis inhibitor (PI-88). J Med Chem48:8229-36 (2005) 
 
Fibroblast growth factor 2
Name:Fibroblast growth factor 2
Type:Protein
Mol. Mass.:30803.89
Organism:Homo sapiens (Human)
Description:P09038
Residue:288
BDBM50179254
NameBDBM50179254
Synonyms:(2R,3S,4S,5S,6R)-2-{[(2R,3S,4S,5R,6R)-2-{[(2R,3S,4S,5R,6R)-2-{[(2R,3S,4S,5R,6R)-2-{[(2S,3S,4S,5S,6R)-2-(benzyloxy)-4,5-dihydroxy-6-(hydroxymethyl)oxan-3-yl]oxy}-3,5-dihydroxy-6-(hydroxymethyl)oxan-4-yl]oxy}-3,5-dihydroxy-6-(hydroxymethyl)oxan-4-yl]oxy}-3,5-dihydroxy-6-(hydroxymethyl)oxan-4-yl]oxy}-6-(hydroxymethyl)oxane-3,4,5-triol | CHEMBL382044
TypeSmall organic molecule
Emp. Form.C37H58O26
Mol. Mass.918.8408
SMILESOC[C@H]1O[C@H](O[C@H]2[C@H](O)[C@@H](CO)O[C@H](O[C@H]3[C@H](O)[C@@H](CO)O[C@H](O[C@H]4[C@H](O)[C@@H](CO)O[C@H](O[C@H]5[C@@H](O)[C@H](O)[C@@H](CO)O[C@@H]5OCc5ccccc5)[C@H]4O)[C@H]3O)[C@H]2O)[C@@H](O)[C@@H](O)[C@@H]1O