Reaction Details
TargetParathyroid hormone/parathyroid hormone-related peptide receptor
LigandBDBM50600475
Substrate/Competitorn/a
Meas. Tech.ChEMBL_2234293 (CHEMBL5148065)
IC50 100±n/a nM
Citation Arai, YKiyotsuka, YNagamochi, MOyama, KIzumi, M Lead optimization of pyrido[2,3-d][1]benzazepin-6-one derivatives leading to the discovery of a potent, selective, and orally available human parathyroid hormone receptor 1 (hPTHR1) antagonist (DS69910557). Bioorg Med Chem64:0 (2022) 
 
Parathyroid hormone/parathyroid hormone-related peptide receptor
Name:Parathyroid hormone/parathyroid hormone-related peptide receptor
Type:Enzyme Catalytic Domain
Mol. Mass.:66370.95
Organism:Homo sapiens (Human)
Description:PARATHYROID HT1 0 HUMAN::Q03431
Residue:593
BDBM50600475
NameBDBM50600475
Synonyms:CHEMBL5190633
TypeSmall organic molecule
Emp. Form.C31H34Cl2N4O3
Mol. Mass.581.533
SMILESCOC1(CNC2CCOCC2)CN(C1)c1ccc(cc1)N1c2cc(Cl)ccc2-c2cc(Cl)cnc2C(C)(C)C1=O