Reaction Details
TargetParathyroid hormone/parathyroid hormone-related peptide receptor
LigandBDBM50600483
Substrate/Competitorn/a
Meas. Tech.ChEMBL_2234293 (CHEMBL5148065)
IC50 80±n/a nM
Citation Arai, YKiyotsuka, YNagamochi, MOyama, KIzumi, M Lead optimization of pyrido[2,3-d][1]benzazepin-6-one derivatives leading to the discovery of a potent, selective, and orally available human parathyroid hormone receptor 1 (hPTHR1) antagonist (DS69910557). Bioorg Med Chem64:0 (2022) 
 
Parathyroid hormone/parathyroid hormone-related peptide receptor
Name:Parathyroid hormone/parathyroid hormone-related peptide receptor
Type:Enzyme Catalytic Domain
Mol. Mass.:66370.95
Organism:Homo sapiens (Human)
Description:PARATHYROID HT1 0 HUMAN::Q03431
Residue:593
BDBM50600483
NameBDBM50600483
Synonyms:CHEMBL5201424
TypeSmall organic molecule
Emp. Form.C32H33Cl2FN4O3
Mol. Mass.611.534
SMILESCC1(C)c2ncc(Cl)cc2-c2ccc(Cl)cc2N(c2ccc(cc2)N2CC(F)(CN[C@H]3CC[C@@H](CC3)C(O)=O)C2)C1=O