Reaction Details
TargetVoltage-dependent calcium channel subunit alpha-2/delta-1
LigandBDBM50179710
Substrate/Competitorn/a
Meas. Tech.ChEMBL_335548 (CHEMBL859414)
Ki 5.3±n/a nM
Citation Mortell, KHAnderson, DJLynch, JJNelson, SLSarris, KMcDonald, HSabet, RBaker, SHonore, PLee, CHJarvis, MFGopalakrishnan, M Structure-activity relationships of alpha-amino acid ligands for the alpha2delta subunit of voltage-gated calcium channels. Bioorg Med Chem Lett16:1138-41 (2006) 
 
Voltage-dependent calcium channel subunit alpha-2/delta-1
Name:Voltage-dependent calcium channel subunit alpha-2/delta-1
Type:PROTEIN
Mol. Mass.:124608.02
Organism:Mus musculus
Description:ChEMBL_335548
Residue:1103
BDBM50179710
NameBDBM50179710
Synonyms:4-(2,3-dichlorobenzylthio)-2-aminobutanoic acid | CHEMBL413572
TypeSmall organic molecule
Emp. Form.C11H13Cl2NO2S
Mol. Mass.294.197
SMILESNC(CCSCc1cccc(Cl)c1Cl)C(O)=O