Reaction Details
TargetPotassium voltage-gated channel subfamily H member 2
LigandBDBM50179771
Substrate/Competitorn/a
Meas. Tech.ChEMBL_336038 (CHEMBL865929)
Ki 327±n/a nM
Citation Hollingworth, GJCarlson, EJCastro, JLChicchi, GGClark, NCooper, LCDirat, OSalvo, JDElliott, JMKilburn, RKurtz, MMRycroft, WTattersall, FDTsao, KLSwain, CJ Novel lactam NK1 antagonists with anti-emetic activity. Bioorg Med Chem Lett16:1197-201 (2006) 
 
Potassium voltage-gated channel subfamily H member 2
Name:Potassium voltage-gated channel subfamily H member 2
Type:Multi-pass membrane protein
Mol. Mass.:126672.65
Organism:Homo sapiens (Human)
Description:Q12809
Residue:1159
BDBM50179771
NameBDBM50179771
Synonyms:3-(3,5-bis-trifluoromethyl-phenyl)-1-[4-(2-oxa-8-aza-spiro[4.5]dec-8-yl)-1-phenyl-cyclohexyl]-pyrrolidin-2-one | CHEMBL202439
TypeSmall organic molecule
Emp. Form.C32H36F6N2O2
Mol. Mass.594.6309
SMILESFC(F)(F)c1cc(cc(c1)C(F)(F)F)C1CCN(C1=O)[C@]1(CC[C@@H](CC1)N1CCC2(CCOC2)CC1)c1ccccc1