Reaction Details
TargetSubstance-P receptor
LigandBDBM50179773
Substrate/Competitorn/a
Meas. Tech.ChEMBL_336032 (CHEMBL867164)
IC50 0.34±n/a nM
Citation Hollingworth, GJCarlson, EJCastro, JLChicchi, GGClark, NCooper, LCDirat, OSalvo, JDElliott, JMKilburn, RKurtz, MMRycroft, WTattersall, FDTsao, KLSwain, CJ Novel lactam NK1 antagonists with anti-emetic activity. Bioorg Med Chem Lett16:1197-201 (2006) 
 
Substance-P receptor
Name:Substance-P receptor
Type:G Protein-Coupled Receptor (GPCR)
Mol. Mass.:46254.43
Organism:Homo sapiens (Human)
Description:P25103
Residue:407
BDBM50179773
NameBDBM50179773
Synonyms:2-(3,5-bis-trifluoromethyl-phenyl)-N-[4-(2-oxa-8-aza-spiro[4.5]dec-8-yl)-1-phenyl-cyclohexyl]-propionamide | CHEMBL381390
TypeSmall organic molecule
Emp. Form.C31H36F6N2O2
Mol. Mass.582.6202
SMILESCC(C(=O)N[C@]1(CC[C@@H](CC1)N1CCC2(CCOC2)CC1)c1ccccc1)c1cc(cc(c1)C(F)(F)F)C(F)(F)F