Reaction Details
TargetGABA-A receptor; alpha-2/beta-3/gamma-2
LigandBDBM50179849
Substrate/Competitorn/a
Meas. Tech.ChEMBL_340229 (CHEMBL863773)
Ki 3.7±n/a nM
Citation Jennings, ASLewis, RTRussell, MGHallett, DJStreet, LJCastro, JLAtack, JRCook, SMLincoln, RStanley, JSmith, AJReynolds, DSSohal, BPike, AMarshall, GRWafford, KASheppard, WFTye, SJ Imidazo[1,2-b][1,2,4]triazines as alpha2/alpha3 subtype selective GABA A agonists for the treatment of anxiety. Bioorg Med Chem Lett16:1477-80 (2006) 
 
GABA-A receptor; alpha-2/beta-3/gamma-2
Name:GABA-A receptor; alpha-2/beta-3/gamma-2
Type:n/a
Mol. Mass.:n/a
Description:ASSAY_ID of ChEMBL is 2148174
Components:This complex has 3 components.
Component 1
Name:Gamma-aminobutyric acid receptor subunit gamma-2
Synonyms:GABA(A) receptor subunit gamma-2 GBRG2_HUMAN
Type:PROTEIN
Mol. Mass.:54172.74
Organism:Homo sapiens (Human)
Description:EBI_217
Residue:467
Component 2
Name:Gamma-aminobutyric acid receptor subunit beta-3
Synonyms:GABA A receptor alpha-4/beta-3/gamma-2 GABA-A receptor GBRB3_HUMAN | agonist GABA site
Type:PROTEIN
Mol. Mass.:54130.51
Organism:Homo sapiens (Human)
Description:ChEMBL_448071
Residue:473
Component 3
Name:Gamma-aminobutyric acid receptor subunit alpha-2
Synonyms:GABA receptor alpha-2 subunit GBRA2_HUMAN | Gamma-aminobutyric acid receptor subunit alpha-2 (GABRA2)
Type:Protein
Mol. Mass.:51338.78
Organism:Homo sapiens (Human)
Description:P47869
Residue:451
BDBM50179849
NameBDBM50179849
Synonyms:2-(3-(4-fluoro-3-(pyridin-3-yl)phenyl)imidazo[1,2-a]pyrimidin-7-yl)propan-2-ol CHEMBL201472
TypeSmall organic molecule
Emp. Form.C20H17FN4O
Mol. Mass.348.3736
SMILESCC(C)(O)c1ccn2c(cnc2n1)-c1ccc(F)c(c1)-c1cccnc1