Reaction Details
TargetGamma-aminobutyric acid receptor subunit alpha-3/beta-3/gamma-2
LigandBDBM50179929
Substrate/Competitorn/a
Meas. Tech.ChEMBL_340478 (CHEMBL862582)
Ki 0.32±n/a nM
Citation Humphries, ACGancia, EGilligan, MTGoodacre, SHallett, DMerchant, KJThomas, SR 8-Fluoroimidazo[1,2-a]pyridine: synthesis, physicochemical properties and evaluation as a bioisosteric replacement for imidazo[1,2-a]pyrimidine in an allosteric modulator ligand of the GABA A receptor. Bioorg Med Chem Lett16:1518-22 (2006) 
 
Gamma-aminobutyric acid receptor subunit alpha-3/beta-3/gamma-2
Name:Gamma-aminobutyric acid receptor subunit alpha-3/beta-3/gamma-2
Type:n/a
Mol. Mass.:n/a
Description:ASSAY_ID of EBI is 68410
Components:This complex has 3 components.
Component 1
Name:Gamma-aminobutyric acid receptor subunit gamma-2
Synonyms:GABA(A) receptor subunit gamma-2 GBRG2_HUMAN
Type:PROTEIN
Mol. Mass.:54172.74
Organism:Homo sapiens (Human)
Description:EBI_217
Residue:467
Component 2
Name:Gamma-aminobutyric acid receptor subunit beta-3
Synonyms:GABA A receptor alpha-4/beta-3/gamma-2 GABA-A receptor GBRB3_HUMAN | agonist GABA site
Type:PROTEIN
Mol. Mass.:54130.51
Organism:Homo sapiens (Human)
Description:ChEMBL_448071
Residue:473
Component 3
Name:Gamma-aminobutyric acid receptor subunit alpha-3
Synonyms:GABA A Alpha3Beta3Gamma2 GABA C GABA-A receptor GBRA3_HUMAN agonist GABA site
Type:Enzyme Catalytic Domain
Mol. Mass.:55175.47
Organism:Homo sapiens (Human)
Description:GABA A Alpha3Beta1Gamma2 0 HUMAN::P34903
Residue:492
BDBM50179929
NameBDBM50179929
Synonyms:2'-Fluoro-5'-[8-fluoro-7-(1-hydroxy-1-methyl-ethyl)-imidazo[1,2-a]pyridin-3-yl]-biphenyl-2-carbonitrile | CHEMBL202952
TypeSmall organic molecule
Emp. Form.C23H17F2N3O
Mol. Mass.389.3974
SMILESCC(C)(O)c1ccn2c(cnc2c1F)-c1ccc(F)c(c1)-c1ccccc1C#N