Reaction Details
TargetCannabinoid receptor 1
LigandBDBM50029958
Substrate/Competitorn/a
Meas. Tech.ChEMBL_2235434 (CHEMBL5149206)
Ki 1.7±n/a nM
Citation Gündel, DDeuther-Conrad, WUeberham, LKaur, SOtikova, ETeodoro, RToussaint, MLai, THClauß, OScheunemann, MBormans, GBachmann, MKopka, KBrust, PMoldovan, RP Structure-Based Design, Optimization, and Development of [ J Med Chem65:9034-9049 (2022) 
 
Cannabinoid receptor 1
Name:Cannabinoid receptor 1
Type:G Protein-Coupled Receptor (GPCR)
Mol. Mass.:52868.96
Organism:Homo sapiens (Human)
Description:P21554
Residue:472
BDBM50029958
NameBDBM50029958
Synonyms:CHEMBL3353439
TypeSmall organic molecule
Emp. Form.C23H23BrFN3O2
Mol. Mass.472.35
SMILESCC1CCC(CC1)NC(=O)c1cc2cc(Br)cnc2n(Cc2ccc(F)cc2)c1=O