Reaction Details
Target5-hydroxytryptamine receptor 2C
LigandBDBM50180252
Substrate/Competitorn/a
Meas. Tech.ChEMBL_329318 (CHEMBL863541)
EC50 6.7±n/a nM
Citation May, JADantanarayana, APZinke, PWMcLaughlin, MASharif, NA 1-((S)-2-aminopropyl)-1H-indazol-6-ol: a potent peripherally acting 5-HT2 receptor agonist with ocular hypotensive activity. J Med Chem49:318-28 (2006) 
 
5-hydroxytryptamine receptor 2C
Name:5-hydroxytryptamine receptor 2C
Type:Enzyme
Mol. Mass.:51935.10
Organism:Rattus norvegicus (Rat)
Description:P08909
Residue:460
BDBM50180252
NameBDBM50180252
Synonyms:(2S)-1-(6-methoxy-1H-indazol-1-yl)propan-2-amine CHEMBL199775
TypeSmall organic molecule
Emp. Form.C11H15N3O
Mol. Mass.205.2563
SMILESCOc1ccc2cnn(C[C@H](C)N)c2c1