Reaction Details
Target5-hydroxytryptamine receptor 2C
LigandBDBM50180253
Substrate/Competitorn/a
Meas. Tech.ChEMBL_329321 (CHEMBL863544)
Ki 3.6±n/a nM
Citation May, JADantanarayana, APZinke, PWMcLaughlin, MASharif, NA 1-((S)-2-aminopropyl)-1H-indazol-6-ol: a potent peripherally acting 5-HT2 receptor agonist with ocular hypotensive activity. J Med Chem49:318-28 (2006) 
 
5-hydroxytryptamine receptor 2C
Name:5-hydroxytryptamine receptor 2C
Type:G Protein-Coupled Receptor (GPCR)
Mol. Mass.:51836.79
Organism:Homo sapiens (Human)
Description:P28335
Residue:458
BDBM50180253
NameBDBM50180253
Synonyms:1-((S)-2-aminopropyl)-7-methyl-1H-indazol-6-ol | CHEMBL200104
TypeSmall organic molecule
Emp. Form.C11H15N3O
Mol. Mass.205.2563
SMILESC[C@H](N)Cn1ncc2ccc(O)c(C)c12