Reaction Details
Target5-hydroxytryptamine receptor 2C
LigandBDBM50133231
Substrate/Competitorn/a
Meas. Tech.ChEMBL_329318 (CHEMBL863541)
EC50 30±n/a nM
Citation May, JADantanarayana, APZinke, PWMcLaughlin, MASharif, NA 1-((S)-2-aminopropyl)-1H-indazol-6-ol: a potent peripherally acting 5-HT2 receptor agonist with ocular hypotensive activity. J Med Chem49:318-28 (2006) 
 
5-hydroxytryptamine receptor 2C
Name:5-hydroxytryptamine receptor 2C
Type:Enzyme
Mol. Mass.:51935.10
Organism:Rattus norvegicus (Rat)
Description:P08909
Residue:460
BDBM50133231
NameBDBM50133231
Synonyms:(R)-1-(4-iodo-2,5-dimethoxyphenyl)propan-2-amine (R)-2-(4-iodo-2,5-dimethoxyphenyl)-1-methylethylamine | CHEMBL134519
TypeSmall organic molecule
Emp. Form.C11H16INO2
Mol. Mass.321.1547
SMILESCOc1cc(C[C@@H](C)N)c(OC)cc1I