Reaction Details
Target5-hydroxytryptamine receptor 2C
LigandBDBM50180258
Substrate/Competitorn/a
Meas. Tech.ChEMBL_329318 (CHEMBL863541)
EC50 5.5±n/a nM
Citation May, JADantanarayana, APZinke, PWMcLaughlin, MASharif, NA 1-((S)-2-aminopropyl)-1H-indazol-6-ol: a potent peripherally acting 5-HT2 receptor agonist with ocular hypotensive activity. J Med Chem49:318-28 (2006) 
 
5-hydroxytryptamine receptor 2C
Name:5-hydroxytryptamine receptor 2C
Type:Enzyme
Mol. Mass.:51935.10
Organism:Rattus norvegicus (Rat)
Description:P08909
Residue:460
BDBM50180258
NameBDBM50180258
Synonyms:1-((S)-2-aminopropyl)-7-fluoro-1H-indazol-6-ol | CHEMBL197653
TypeSmall organic molecule
Emp. Form.C10H12FN3O
Mol. Mass.209.2202
SMILESC[C@H](N)Cn1ncc2ccc(O)c(F)c12