Reaction Details
Target5-hydroxytryptamine receptor 2A
LigandBDBM50180258
Substrate/Competitorn/a
Meas. Tech.ChEMBL_329319 (CHEMBL860341)
Ki 5.8±n/a nM
Citation May, JADantanarayana, APZinke, PWMcLaughlin, MASharif, NA 1-((S)-2-aminopropyl)-1H-indazol-6-ol: a potent peripherally acting 5-HT2 receptor agonist with ocular hypotensive activity. J Med Chem49:318-28 (2006) 
 
5-hydroxytryptamine receptor 2A
Name:5-hydroxytryptamine receptor 2A
Type:undefined
Mol. Mass.:52607.65
Organism:Homo sapiens (Human)
Description:P28223
Residue:471
BDBM50180258
NameBDBM50180258
Synonyms:1-((S)-2-aminopropyl)-7-fluoro-1H-indazol-6-ol | CHEMBL197653
TypeSmall organic molecule
Emp. Form.C10H12FN3O
Mol. Mass.209.2202
SMILESC[C@H](N)Cn1ncc2ccc(O)c(F)c12