Reaction Details
TargetD(2) dopamine receptor
LigandBDBM50132025
Substrate/Competitorn/a
Meas. Tech.ChEMBL_329486 (CHEMBL861746)
Ki 146±n/a nM
Citation Leopoldo, MLacivita, EDe Giorgio, PColabufo, NANiso, MBerardi, FPerrone, R Design, synthesis, and binding affinities of potential positron emission tomography (PET) ligands for visualization of brain dopamine D3 receptors. J Med Chem49:358-65 (2006) 
 
D(2) dopamine receptor
Name:D(2) dopamine receptor
Type:Cell-surface receptors
Mol. Mass.:50647.10
Organism:Homo sapiens (Human)
Description:P14416
Residue:443
BDBM50132025
NameBDBM50132025
Synonyms:2-Oxo-2H-chromene-3-carboxylic acid {4-[4-(2-methoxy-phenyl)-piperazin-1-yl]-butyl}-amide N-[4-[4-(2-methoxyphenyl)piperazin-1-yl]butyl]-2-oxo-2H-1-benzopyran-3-carboxamide
TypeSmall organic molecule
Emp. Form.C25H29N3O4
Mol. Mass.435.5155
SMILESCOc1ccccc1N1CCN(CCCCNC(=O)c2cc3ccccc3oc2=O)CC1