Reaction Details
TargetGamma-aminobutyric acid receptor subunit alpha-3/beta-3/gamma-2
LigandBDBM50180005
Substrate/Competitorn/a
Meas. Tech.ChEMBL_335930 (CHEMBL861281)
Ki 13±n/a nM
Citation Blackaby, WPAtack, JRBromidge, FCastro, JLGoodacre, SCHallett, DJLewis, RTMarshall, GRPike, ASmith, AJStreet, LJTattersall, DFWafford, KA Imidazo[1,2-a]pyrimidines as functionally selective GABA(A) ligands. Bioorg Med Chem Lett16:1175-9 (2006) 
 
Gamma-aminobutyric acid receptor subunit alpha-3/beta-3/gamma-2
Name:Gamma-aminobutyric acid receptor subunit alpha-3/beta-3/gamma-2
Type:n/a
Mol. Mass.:n/a
Description:ASSAY_ID of EBI is 68410
Components:This complex has 3 components.
Component 1
Name:Gamma-aminobutyric acid receptor subunit gamma-2
Synonyms:GABA(A) receptor subunit gamma-2 GBRG2_HUMAN
Type:PROTEIN
Mol. Mass.:54172.74
Organism:Homo sapiens (Human)
Description:EBI_217
Residue:467
Component 2
Name:Gamma-aminobutyric acid receptor subunit beta-3
Synonyms:GABA A receptor alpha-4/beta-3/gamma-2 GABA-A receptor GBRB3_HUMAN | agonist GABA site
Type:PROTEIN
Mol. Mass.:54130.51
Organism:Homo sapiens (Human)
Description:ChEMBL_448071
Residue:473
Component 3
Name:Gamma-aminobutyric acid receptor subunit alpha-3
Synonyms:GABA A Alpha3Beta3Gamma2 GABA C GABA-A receptor GBRA3_HUMAN agonist GABA site
Type:Enzyme Catalytic Domain
Mol. Mass.:55175.47
Organism:Homo sapiens (Human)
Description:GABA A Alpha3Beta1Gamma2 0 HUMAN::P34903
Residue:492
BDBM50180005
NameBDBM50180005
Synonyms:1-(1-(3-(pyridin-3-yl)phenyl)-1H-benzo[d]imidazol-5-yl)ethanone O-ethyl oxime | CHEMBL381625
TypeSmall organic molecule
Emp. Form.C22H20N4O
Mol. Mass.356.4204
SMILESCCO\N=C(/C)c1ccc2n(cnc2c1)-c1cccc(c1)-c1cccnc1