Reaction Details
TargetGamma-aminobutyric acid receptor subunit alpha-1/beta-3/gamma-2
LigandBDBM50180388
Substrate/Competitorn/a
Meas. Tech.ChEMBL_335929 (CHEMBL861280)
Ki 0.31±n/a nM
Citation Blackaby, WPAtack, JRBromidge, FCastro, JLGoodacre, SCHallett, DJLewis, RTMarshall, GRPike, ASmith, AJStreet, LJTattersall, DFWafford, KA Imidazo[1,2-a]pyrimidines as functionally selective GABA(A) ligands. Bioorg Med Chem Lett16:1175-9 (2006) 
 
Gamma-aminobutyric acid receptor subunit alpha-1/beta-3/gamma-2
Name:Gamma-aminobutyric acid receptor subunit alpha-1/beta-3/gamma-2
Type:Protein
Mol. Mass.:n/a
Description:n/a
Components:This complex has 3 components.
Component 1
Name:Gamma-aminobutyric acid receptor subunit alpha-1
Synonyms:Benzodiazepine central GABA A Benzodiazepine liver GABA(A) receptor subunit alpha-1 GABA-A receptor GBRA1_HUMAN TBPS | agonist GABA site
Type:Protein
Mol. Mass.:51817.35
Organism:Homo sapiens (Human)
Description:P14867
Residue:456
Component 2
Name:Gamma-aminobutyric acid receptor subunit beta-3
Synonyms:GABA A receptor alpha-4/beta-3/gamma-2 GABA-A receptor GBRB3_HUMAN | agonist GABA site
Type:PROTEIN
Mol. Mass.:54130.51
Organism:Homo sapiens (Human)
Description:ChEMBL_448071
Residue:473
Component 3
Name:Gamma-aminobutyric acid receptor subunit gamma-2
Synonyms:GABA(A) receptor subunit gamma-2 GBRG2_HUMAN
Type:PROTEIN
Mol. Mass.:54172.74
Organism:Homo sapiens (Human)
Description:EBI_217
Residue:467
BDBM50180388
NameBDBM50180388
Synonyms:3-(6-bromopyridin-2-yl)-7-(trifluoromethyl)imidazo[1,2-a]pyrimidine | CHEMBL203768
TypeSmall organic molecule
Emp. Form.C12H6BrF3N4
Mol. Mass.343.102
SMILESFC(F)(F)c1ccn2c(cnc2n1)-c1cccc(Br)n1