Reaction Details
TargetBeta-secretase 1
LigandBDBM50180393
Substrate/Competitorn/a
Meas. Tech.ChEMBL_346607 (CHEMBL863816)
IC50 93±n/a nM
Citation Garino, CPietrancosta, NLaras, YMoret, VRolland, AQuéléver, GKraus, JL BACE-1 inhibitory activities of new substituted phenyl-piperazine coupled to various heterocycles: chromene, coumarin and quinoline. Bioorg Med Chem Lett16:1995-9 (2006) 
 
Beta-secretase 1
Name:Beta-secretase 1
Type:Protein
Mol. Mass.:55755.10
Organism:Homo sapiens (Human)
Description:P56817
Residue:501
BDBM50180393
NameBDBM50180393
Synonyms:CHEMBL205309 | tert-butyl 4-(4-bromo-2-(2-(7-methoxy-2-oxo-2H-chromen-4-yl)acetamido)phenyl)piperazine-1-carboxylate
TypeSmall organic molecule
Emp. Form.C27H30BrN3O6
Mol. Mass.572.448
SMILESCOc1ccc2c(CC(=O)Nc3cc(Br)ccc3N3CCN(CC3)C(=O)OC(C)(C)C)cc(=O)oc2c1