Reaction Details
TargetMuscarinic acetylcholine receptor M3
LigandBDBM50181101
Substrate/Competitorn/a
Meas. Tech.ChEMBL_345379 (CHEMBL861122)
Ki 50±n/a nM
Citation Provins, LChristophe, BDanhaive, PDulieu, JDurieu, VGillard, MLebon, FLengelé, SQuéré, Lvan Keulen, B First dual M3 antagonists-PDE4 inhibitors: synthesis and SAR of 4,6-diaminopyrimidine derivatives. Bioorg Med Chem Lett16:1834-9 (2006) 
 
Muscarinic acetylcholine receptor M3
Name:Muscarinic acetylcholine receptor M3
Type:Enzyme
Mol. Mass.:66151.03
Organism:Homo sapiens (Human)
Description:P20309
Residue:590
BDBM50181101
NameBDBM50181101
Synonyms:CHEMBL381752 | N,2-dicyclopropyl-6-(4,4-difluoropiperidin-1-yl)-5-methylpyrimidin-4-amine
TypeSmall organic molecule
Emp. Form.C16H22F2N4
Mol. Mass.308.3695
SMILESCc1c(NC2CC2)nc(nc1N1CCC(F)(F)CC1)C1CC1