Reaction Details
TargetMuscarinic acetylcholine receptor M3
LigandBDBM50181122
Substrate/Competitorn/a
Meas. Tech.ChEMBL_345379 (CHEMBL861122)
Ki 158±n/a nM
Citation Provins, LChristophe, BDanhaive, PDulieu, JDurieu, VGillard, MLebon, FLengelé, SQuéré, Lvan Keulen, B First dual M3 antagonists-PDE4 inhibitors: synthesis and SAR of 4,6-diaminopyrimidine derivatives. Bioorg Med Chem Lett16:1834-9 (2006) 
 
Muscarinic acetylcholine receptor M3
Name:Muscarinic acetylcholine receptor M3
Type:Enzyme
Mol. Mass.:66151.03
Organism:Homo sapiens (Human)
Description:P20309
Residue:590
BDBM50181122
NameBDBM50181122
Synonyms:CHEMBL204353 | [6-(8-aza-spiro[4.5]dec-8-yl)-2-cyclopropyl-5-methyl-pyrimidin-4-yl]-cyclopropyl-amine
TypeSmall organic molecule
Emp. Form.C20H30N4
Mol. Mass.326.479
SMILESCc1c(NC2CC2)nc(nc1N1CCC2(CCCC2)CC1)C1CC1