Reaction Details
TargetMuscarinic acetylcholine receptor M3
LigandBDBM50181132
Substrate/Competitorn/a
Meas. Tech.ChEMBL_345379 (CHEMBL861122)
Ki 79±n/a nM
Citation Provins, LChristophe, BDanhaive, PDulieu, JDurieu, VGillard, MLebon, FLengelé, SQuéré, Lvan Keulen, B First dual M3 antagonists-PDE4 inhibitors: synthesis and SAR of 4,6-diaminopyrimidine derivatives. Bioorg Med Chem Lett16:1834-9 (2006) 
 
Muscarinic acetylcholine receptor M3
Name:Muscarinic acetylcholine receptor M3
Type:Enzyme
Mol. Mass.:66151.03
Organism:Homo sapiens (Human)
Description:P20309
Residue:590
BDBM50181132
NameBDBM50181132
Synonyms:CHEMBL205853 | cyclopropyl-(2-cyclopropyl-5-methyl-6-thiomorpholin-4-yl-pyrimidin-4-yl)-amine
TypeSmall organic molecule
Emp. Form.C15H22N4S
Mol. Mass.290.427
SMILESCc1c(NC2CC2)nc(nc1N1CCSCC1)C1CC1