Reaction Details
TargetPlatelet-derived growth factor receptor beta
LigandBDBM50181303
Substrate/Competitorn/a
Meas. Tech.ChEMBL_347373 (CHEMBL865653)
IC50 49±n/a nM
Citation Frazier, KJazan, EMcBride, CMPecchi, SRenhowe, PAShafer, CMTaylor, CBussiere, DHe, MMJansen, JMLapointe, GMa, SVora, JWiesmann, M Design and structure-activity relationship of heterocyclic analogs of 4-amino-3-benzimidazol-2-ylhydroquinolin-2-ones as inhibitors of receptor tyrosine kinases. Bioorg Med Chem Lett16:2247-51 (2006) 
 
Platelet-derived growth factor receptor beta
Name:Platelet-derived growth factor receptor beta
Type:Enzyme
Mol. Mass.:122771.00
Organism:Mus musculus (mouse)
Description:P05622
Residue:1098
BDBM50181303
NameBDBM50181303
Synonyms:4-amino-3-(3H-imidazo[4,5-b]pyridin-2-yl)-1,7-naphthyridin-2(1H)-one | CHEMBL204985
TypeSmall organic molecule
Emp. Form.C14H10N6O
Mol. Mass.278.2688
SMILESNc1c(-c2nc3ncccc3[nH]2)c(=O)[nH]c2cnccc12