Reaction Details
TargetVascular endothelial growth factor receptor 2
LigandBDBM50181310
Substrate/Competitorn/a
Meas. Tech.ChEMBL_347372 (CHEMBL865652)
IC50 168±n/a nM
Citation Frazier, KJazan, EMcBride, CMPecchi, SRenhowe, PAShafer, CMTaylor, CBussiere, DHe, MMJansen, JMLapointe, GMa, SVora, JWiesmann, M Design and structure-activity relationship of heterocyclic analogs of 4-amino-3-benzimidazol-2-ylhydroquinolin-2-ones as inhibitors of receptor tyrosine kinases. Bioorg Med Chem Lett16:2247-51 (2006) 
 
Vascular endothelial growth factor receptor 2
Name:Vascular endothelial growth factor receptor 2
Type:PROTEIN
Mol. Mass.:152506.58
Organism:Mus musculus
Description:ChEMBL_1469997
Residue:1367
BDBM50181310
NameBDBM50181310
Synonyms:3-(1H-benzo[d]imidazol-2-yl)-4-hydroxy-1,7-naphthyridin-2(1H)-one | CHEMBL206410
TypeSmall organic molecule
Emp. Form.C15H10N4O2
Mol. Mass.278.2655
SMILESOc1c(-c2nc3ccccc3[nH]2)c(=O)[nH]c2cnccc12