Reaction Details
TargetPlatelet-derived growth factor receptor beta
LigandBDBM50181315
Substrate/Competitorn/a
Meas. Tech.ChEMBL_347373 (CHEMBL865653)
IC50 30±n/a nM
Citation Frazier, KJazan, EMcBride, CMPecchi, SRenhowe, PAShafer, CMTaylor, CBussiere, DHe, MMJansen, JMLapointe, GMa, SVora, JWiesmann, M Design and structure-activity relationship of heterocyclic analogs of 4-amino-3-benzimidazol-2-ylhydroquinolin-2-ones as inhibitors of receptor tyrosine kinases. Bioorg Med Chem Lett16:2247-51 (2006) 
 
Platelet-derived growth factor receptor beta
Name:Platelet-derived growth factor receptor beta
Type:Enzyme
Mol. Mass.:122771.00
Organism:Mus musculus (mouse)
Description:P05622
Residue:1098
BDBM50181315
NameBDBM50181315
Synonyms:4-amino-3-(5-(4-methylpiperazin-1-yl)-3H-imidazo[4,5-b]pyridin-2-yl)quinolin-2(1H)-one | CHEMBL204524
TypeSmall organic molecule
Emp. Form.C20H21N7O
Mol. Mass.375.427
SMILESCN1CCN(CC1)c1ccc2[nH]c(nc2n1)-c1c(N)c2ccccc2[nH]c1=O