Reaction Details
TargetVascular endothelial growth factor receptor 1
LigandBDBM50181317
Substrate/Competitorn/a
Meas. Tech.ChEMBL_347371 (CHEMBL865651)
IC50 162±n/a nM
Citation Frazier, KJazan, EMcBride, CMPecchi, SRenhowe, PAShafer, CMTaylor, CBussiere, DHe, MMJansen, JMLapointe, GMa, SVora, JWiesmann, M Design and structure-activity relationship of heterocyclic analogs of 4-amino-3-benzimidazol-2-ylhydroquinolin-2-ones as inhibitors of receptor tyrosine kinases. Bioorg Med Chem Lett16:2247-51 (2006) 
 
Vascular endothelial growth factor receptor 1
Name:Vascular endothelial growth factor receptor 1
Type:Receptor Tyrosine Kinase
Mol. Mass.:150800.23
Organism:Homo sapiens (Human)
Description:P17948
Residue:1338
BDBM50181317
NameBDBM50181317
Synonyms:3-(1H-benzo[d]imidazol-2-yl)-4-hydroxyquinolin-2(1H)-one | CHEMBL377345
TypeSmall organic molecule
Emp. Form.C16H11N3O2
Mol. Mass.277.2774
SMILESOc1c(-c2nc3ccccc3[nH]2)c(=O)[nH]c2ccccc12