Reaction Details
TargetFibroblast growth factor receptor 1
LigandBDBM50181305
Substrate/Competitorn/a
Meas. Tech.ChEMBL_347374 (CHEMBL865654)
IC50 44±n/a nM
Citation Frazier, KJazan, EMcBride, CMPecchi, SRenhowe, PAShafer, CMTaylor, CBussiere, DHe, MMJansen, JMLapointe, GMa, SVora, JWiesmann, M Design and structure-activity relationship of heterocyclic analogs of 4-amino-3-benzimidazol-2-ylhydroquinolin-2-ones as inhibitors of receptor tyrosine kinases. Bioorg Med Chem Lett16:2247-51 (2006) 
 
Fibroblast growth factor receptor 1
Name:Fibroblast growth factor receptor 1
Type:Receptor
Mol. Mass.:91861.70
Organism:Homo sapiens (Human)
Description:P11362
Residue:822
BDBM50181305
NameBDBM50181305
Synonyms:4-amino-3-(1H-benzo[d]imidazol-2-yl)quinolin-2(1H)-one | CHEMBL383417
TypeSmall organic molecule
Emp. Form.C16H12N4O
Mol. Mass.276.2927
SMILESNc1c(-c2nc3ccccc3[nH]2)c(=O)[nH]c2ccccc12