Reaction Details
TargetPlatelet-derived growth factor receptor beta
LigandBDBM50181319
Substrate/Competitorn/a
Meas. Tech.ChEMBL_347373 (CHEMBL865653)
IC50 64±n/a nM
Citation Frazier, KJazan, EMcBride, CMPecchi, SRenhowe, PAShafer, CMTaylor, CBussiere, DHe, MMJansen, JMLapointe, GMa, SVora, JWiesmann, M Design and structure-activity relationship of heterocyclic analogs of 4-amino-3-benzimidazol-2-ylhydroquinolin-2-ones as inhibitors of receptor tyrosine kinases. Bioorg Med Chem Lett16:2247-51 (2006) 
 
Platelet-derived growth factor receptor beta
Name:Platelet-derived growth factor receptor beta
Type:Enzyme
Mol. Mass.:122771.00
Organism:Mus musculus (mouse)
Description:P05622
Residue:1098
BDBM50181319
NameBDBM50181319
Synonyms:4-amino-3-(6-morpholino-1H-benzo[d]imidazol-2-yl)-1,7-naphthyridin-2(1H)-one | CHEMBL205108
TypeSmall organic molecule
Emp. Form.C19H18N6O2
Mol. Mass.362.3852
SMILESNc1c(-c2nc3ccc(cc3[nH]2)N2CCOCC2)c(=O)[nH]c2cnccc12