Reaction Details
TargetBcl-2-like protein 1
LigandBDBM50181881
Substrate/Competitorn/a
Meas. Tech.ChEMBL_332733 (CHEMBL859057)
EC50 2110±n/a nM
Citation Wendt, MDShen, WKunzer, AMcClellan, WJBruncko, MOost, TKDing, HJoseph, MKZhang, HNimmer, PMNg, SCShoemaker, ARPetros, AMOleksijew, AMarsh, KBauch, JOltersdorf, TBelli, BAMartineau, DFesik, SWRosenberg, SHElmore, SW Discovery and structure-activity relationship of antagonists of B-cell lymphoma 2 family proteins with chemopotentiation activity in vitro and in vivo. J Med Chem49:1165-81 (2006) 
 
Bcl-2-like protein 1
Name:Bcl-2-like protein 1
Type:Mitochondrion membrane; Single-pass membrane protein
Mol. Mass.:26039.60
Organism:Homo sapiens (Human)
Description:n/a
Residue:233
BDBM50181881
NameBDBM50181881
Synonyms:CHEMBL370837 | N-[2'-methoxy-4'-(3-morpholin-4-ylpropyl)biphenyl-4-carbonyl]-4-((R)-3-morpholin-4-yl-1-phenylsulfanylmethylpropylamino)-3-nitrobenzenesulfonamide
TypeSmall organic molecule
Emp. Form.C41H49N5O8S2
Mol. Mass.803.986
SMILESCOc1cc(CCCN2CCOCC2)ccc1-c1ccc(cc1)C(=O)NS(=O)(=O)c1ccc(N[C@H](CCN2CCOCC2)CSc2ccccc2)c(c1)[N+]([O-])=O