Reaction Details
TargetBcl-2-like protein 1
LigandBDBM50181892
Substrate/Competitorn/a
Meas. Tech.ChEMBL_332729 (CHEMBL859053)
Ki 396±n/a nM
Citation Wendt, MDShen, WKunzer, AMcClellan, WJBruncko, MOost, TKDing, HJoseph, MKZhang, HNimmer, PMNg, SCShoemaker, ARPetros, AMOleksijew, AMarsh, KBauch, JOltersdorf, TBelli, BAMartineau, DFesik, SWRosenberg, SHElmore, SW Discovery and structure-activity relationship of antagonists of B-cell lymphoma 2 family proteins with chemopotentiation activity in vitro and in vivo. J Med Chem49:1165-81 (2006) 
 
Bcl-2-like protein 1
Name:Bcl-2-like protein 1
Type:Mitochondrion membrane; Single-pass membrane protein
Mol. Mass.:26039.60
Organism:Homo sapiens (Human)
Description:n/a
Residue:233
BDBM50181892
NameBDBM50181892
Synonyms:4-{4-[3-nitro-4-(2-phenylsulfanylethylamino)benzenesulfonylaminocarbonyl]phenyl}piperazine-1-carboxylic acid tert-butyl ester | CHEMBL202540
TypeSmall organic molecule
Emp. Form.C30H35N5O7S2
Mol. Mass.641.758
SMILESCC(C)(C)OC(=O)N1CCN(CC1)c1ccc(cc1)C(=O)NS(=O)(=O)c1ccc(NCCSc2ccccc2)c(c1)[N+]([O-])=O