Reaction Details
TargetApoptosis regulator Bcl-2
LigandBDBM50181877
Substrate/Competitorn/a
Meas. Tech.ChEMBL_332728 (CHEMBL859052)
Ki 73±n/a nM
Citation Wendt, MDShen, WKunzer, AMcClellan, WJBruncko, MOost, TKDing, HJoseph, MKZhang, HNimmer, PMNg, SCShoemaker, ARPetros, AMOleksijew, AMarsh, KBauch, JOltersdorf, TBelli, BAMartineau, DFesik, SWRosenberg, SHElmore, SW Discovery and structure-activity relationship of antagonists of B-cell lymphoma 2 family proteins with chemopotentiation activity in vitro and in vivo. J Med Chem49:1165-81 (2006) 
 
Apoptosis regulator Bcl-2
Name:Apoptosis regulator Bcl-2
Type:Homodimer or heterodimer
Mol. Mass.:26269.11
Organism:Homo sapiens (Human)
Description:P10415
Residue:239
BDBM50181877
NameBDBM50181877
Synonyms:4-((R)-5-dimethylamino-1-phenylsulfanylmethylpentylamino)-N-[4-(4,4-dimethylpiperidin-1-yl)benzoyl]-3-nitrobenzenesulfonamide | CHEMBL370835
TypeSmall organic molecule
Emp. Form.C34H45N5O5S2
Mol. Mass.667.882
SMILESCN(C)CCCC[C@H](CSc1ccccc1)Nc1ccc(cc1[N+]([O-])=O)S(=O)(=O)NC(=O)c1ccc(cc1)N1CCC(C)(C)CC1