Reaction Details
TargetApoptosis regulator Bcl-2
LigandBDBM50181891
Substrate/Competitorn/a
Meas. Tech.ChEMBL_332728 (CHEMBL859052)
Ki 231±n/a nM
Citation Wendt, MDShen, WKunzer, AMcClellan, WJBruncko, MOost, TKDing, HJoseph, MKZhang, HNimmer, PMNg, SCShoemaker, ARPetros, AMOleksijew, AMarsh, KBauch, JOltersdorf, TBelli, BAMartineau, DFesik, SWRosenberg, SHElmore, SW Discovery and structure-activity relationship of antagonists of B-cell lymphoma 2 family proteins with chemopotentiation activity in vitro and in vivo. J Med Chem49:1165-81 (2006) 
 
Apoptosis regulator Bcl-2
Name:Apoptosis regulator Bcl-2
Type:Homodimer or heterodimer
Mol. Mass.:26269.11
Organism:Homo sapiens (Human)
Description:P10415
Residue:239
BDBM50181891
NameBDBM50181891
Synonyms:4-((R)-5-amino-1-phenylsulfanylmethylpentylamino)-N-[4-(4,4-dimethylpiperidin-1-yl)benzoyl]-3-nitrobenzenesulfonamide | CHEMBL370836
TypeSmall organic molecule
Emp. Form.C32H41N5O5S2
Mol. Mass.639.828
SMILESCC1(C)CCN(CC1)c1ccc(cc1)C(=O)NS(=O)(=O)c1ccc(N[C@H](CCCCN)CSc2ccccc2)c(c1)[N+]([O-])=O