Reaction Details
TargetApoptosis regulator Bcl-2
LigandBDBM50181883
Substrate/Competitorn/a
Meas. Tech.ChEMBL_332728 (CHEMBL859052)
Ki 400±n/a nM
Citation Wendt, MDShen, WKunzer, AMcClellan, WJBruncko, MOost, TKDing, HJoseph, MKZhang, HNimmer, PMNg, SCShoemaker, ARPetros, AMOleksijew, AMarsh, KBauch, JOltersdorf, TBelli, BAMartineau, DFesik, SWRosenberg, SHElmore, SW Discovery and structure-activity relationship of antagonists of B-cell lymphoma 2 family proteins with chemopotentiation activity in vitro and in vivo. J Med Chem49:1165-81 (2006) 
 
Apoptosis regulator Bcl-2
Name:Apoptosis regulator Bcl-2
Type:Homodimer or heterodimer
Mol. Mass.:26269.11
Organism:Homo sapiens (Human)
Description:P10415
Residue:239
BDBM50181883
NameBDBM50181883
Synonyms:3-{2-methoxy-4'-[3-nitro-4-(2-phenylsulfanylethylamino)benzenesulfonylaminocarbonyl]biphenyl-4-yl}-N,N-dimethylpropionamide | CHEMBL382018
TypeSmall organic molecule
Emp. Form.C33H34N4O7S2
Mol. Mass.662.776
SMILESCOc1cc(CCC(=O)N(C)C)ccc1-c1ccc(cc1)C(=O)NS(=O)(=O)c1ccc(NCCSc2ccccc2)c(c1)[N+]([O-])=O