Reaction Details
TargetSerine/threonine-protein kinase B-raf
LigandBDBM50382959
Substrate/Competitorn/a
Meas. Tech.ChEMBL_2238105 (CHEMBL5152001)
Kd 14±n/a nM
Citation Saha, DRyan, KRLakkaniga, NRAcharya, BGarcia, NGSmith, ELFrett, B Targeting Rearranged during Transfection in Cancer: A Perspective on Small-Molecule Inhibitors and Their Clinical Development. J Med Chem64:11747-11773 (2021) 
 
Serine/threonine-protein kinase B-raf
Name:Serine/threonine-protein kinase B-raf
Type:Serine/threonine-protein kinase
Mol. Mass.:84446.00
Organism:Homo sapiens (Human)
Description:P15056
Residue:766
BDBM50382959
NameBDBM50382959
Synonyms:CEP-32496 US9730937, Example 261
TypeSmall organic molecule
Emp. Form.C24H22F3N5O5
Mol. Mass.517.4572
SMILESCOc1cc2ncnc(Oc3cccc(NC(=O)Nc4cc(on4)C(C)(C)C(F)(F)F)c3)c2cc1OC