Reaction Details
TargetMelanocortin receptor 4
LigandBDBM50182070
Substrate/Competitorn/a
Meas. Tech.ChEMBL_348053 (CHEMBL868469)
IC50 1500±n/a nM
Citation Vos, TJBalani, SBlackburn, CChau, RWDanca, MDDrabic, SVFarrer, CAPatane, MAStroud, SGYowe, DLClaiborne, CF Identification and structure-activity relationships of a new series of Melanocortin-4 receptor antagonists. Bioorg Med Chem Lett16:2302-5 (2006) 
 
Melanocortin receptor 4
Name:Melanocortin receptor 4
Type:Enzyme
Mol. Mass.:36949.50
Organism:Homo sapiens (Human)
Description:P32245
Residue:332
BDBM50182070
NameBDBM50182070
Synonyms:CHEMBL205553 | N-(4-diethylamino-1-methyl-butyl)-N'-[3-fluoro-2-(2-naphthalen-1-yl-ethyl)-benzoyl]-guanidine
TypeSmall organic molecule
Emp. Form.C29H37FN4O
Mol. Mass.476.6287
SMILESCCN(CC)CCCC(C)N=C(N)NC(=O)c1cccc(F)c1CCc1cccc2ccccc12