Reaction Details
TargetMelanocortin receptor 4
LigandBDBM50182058
Substrate/Competitorn/a
Meas. Tech.ChEMBL_348051 (CHEMBL868466)
Ki 80±n/a nM
Citation Vos, TJBalani, SBlackburn, CChau, RWDanca, MDDrabic, SVFarrer, CAPatane, MAStroud, SGYowe, DLClaiborne, CF Identification and structure-activity relationships of a new series of Melanocortin-4 receptor antagonists. Bioorg Med Chem Lett16:2302-5 (2006) 
 
Melanocortin receptor 4
Name:Melanocortin receptor 4
Type:Enzyme
Mol. Mass.:36949.50
Organism:Homo sapiens (Human)
Description:P32245
Residue:332
BDBM50182058
NameBDBM50182058
Synonyms:CHEMBL206141 | N-{2-[2-(5-bromo-2-methoxy-phenyl)-ethyl]-3-fluoro-benzoyl}-N'-(3-cyclohexylamino-propyl)-guanidine
TypeSmall organic molecule
Emp. Form.C26H34BrFN4O2
Mol. Mass.533.476
SMILESCOc1ccc(Br)cc1CCc1c(F)cccc1C(=O)NC(N)=NCCCNC1CCCCC1